{"text_format":"3","workbook":"xlsx","n_sheets":4,"sheets":["説明","基礎データシート","計算シート","年休累計シート"],"not_rendered":{"images":10,"macros":1,"comments":2},"read":"whole","date_system":"1900"}

{"sheet":"説明","index":0,"n_rows":47,"n_cols":2,"rows_kept":47}
[]
["注意事項"]
[null,"１日の勤務時間が７時間４５分以外のケースは対応していません。"]
[null,"休憩時間は３分割までしか対応していません。"]
[null,"土日祝日を含んだ年休には対応していません。"]
[null,"残日数のすべてを使い切る時は分単位での使用には対応していません。"]
[null,"時休と年休を続けて取得する場合は分けて入力してください。"]
[null,"本ソフトを使用中または使用した結果、万が一、何らかの不具合が生じてもPCチームは一切の責任を負いませんので、 あらかじめご了承ください。"]
[]
["操作説明"]
[null,"１　基礎データシートへのデータ入力"]
[null,"　①基礎データシートへ学校名、勤務時間、休憩時間、職員情報を入力します。"]
[null,"　②長期休業の情報を入力します。（休憩時間を変更している場合に対応するため）"]
[]
[null,"２　計算シートへのデータ入力　　　※青文字：ソフト操作　　緑文字：休暇簿記載"]
[null,"　①氏名欄をクリックして職員を選択します。"]
[null,"　②年休簿等を確認し、休暇取得前の残日数を入力します。"]
[null,"　③「取得日」には本日の日付が表示されています。曜日等で休憩時間が変更する場合は"]
[null,"　　休暇取得日を入力します。また、２日以上の年休の場合は終了日も入力します。"]
[null,"　④時休の場合は時休開始時間と時休終了時間を入力します。"]
[null,"　　また、時休の時間帯に休憩時間が含まれている場合は、備考欄に「休憩時間を除く」"]
[null,"　　と表示されますので、休暇簿へ記載する際は備考欄に「休憩時間を除く」と"]
[null,"　　記載してください。"]
[null,"　⑤入力した時間が半休となる場合は時間が灰色表示になり、備考欄に「午前」"]
[null,"　　または「午後」と表示されます。休暇簿へ記載する際は時間欄を記載せず、"]
[null,"　　備考欄に「午前」または「午後」と記載してください。"]
[null,"　⑥時間等の入力が終わると「取得時間」や「残日数・時間」が計算されます。"]
[null,"　　「残日数転記」ボタンをクリックすると年休累計シートに取得時間数等が"]
[null,"　　転記されます。また、計算シートの既取得分の欄にも転記されます。"]
[]
[null,"　⑦「出勤時間から時休」または「退勤時間まで時休」ボタンをクリックすると"]
[null,"　　休憩時間を考慮した時間をリスト選択できるようになります。"]
[null,"　　続けて右の「○h」のボタンをクリックすると出勤時刻から（退勤時刻まで）"]
[null,"　　○時間取得の場合の時間が表示されます。"]
[null,"　👇便利なショートカットキーを活用してみましょう！"]
[null,"　　ＡＬＴキーと下記のキーを一緒に押すことでボタンのクリックと同じ動作をします。"]
[null,"　　ｗ　　残日数転記"]
[null,"　　ｓ　　出勤時間から時休"]
[null,"　　ｅ　　退勤時間まで時休"]
[null,"　　1～7　取得時間○ｈ"]
{"$rows_left_out":8}
{"sheet":"基礎データシート","index":1,"n_rows":45,"n_cols":22,"rows_kept":45,"merged":[[2,2,2,5],[2,8,2,16],[3,2,4,2],[3,3,4,3],[3,4,4,4],[3,5,4,5],[3,8,4,8],[3,9,4,9],[3,10,3,11],[3,12,3,13],[3,14,3,15]]}
["基礎データ"]
[]
["学校名",null,"職員\n※同姓同名の場合は空白を半角にするなどして対応してください。",{"$nulls":5},"休憩時間",{"$nulls":9},"長期休業","開始日","終了日","休憩別途\n設定の有無"]
["青森市立青森小学校",null,"番号","職名","氏名","休憩班\n区分",null,null,"休憩班\n区分","曜日等","休憩1回目",null,"休憩2回目",null,"休憩3回目",null,"休憩時間",null,"年度始","4/1","4/6","無"]
[{"$nulls":10},"開始","終了","開始","終了","開始","終了","合計",null,"夏季","7/22","8/23","有"]
["勤務開始時刻",null,1,"校　長","青森　宗一郎",{"v":1,"d":"1班"},null,null,1,"月","12:00:00","12:45:00",{"$nulls":4},{"$f":"IF(K6=\"\",\"\",(L6-K6)+(N6-M6)+(P6-O6))","v":"00:45:00"},null,"冬季","12/24","1/14","有"]
["07:55:00",null,2,"教　頭","北海道　直道",{"v":2,"d":"2班"},null,null,1,"火","12:00:00","12:45:00",{"$nulls":4},{"$f":"IF(K7=\"\",\"\",(L7-K7)+(N7-M7)+(P7-O7))","v":"00:45:00"},null,"年度末","3/27","3/31","有"]
[null,null,3,"教諭","岩手　拓也",{"v":4,"d":"4班"},null,null,1,"水","12:00:00","12:45:00",{"$nulls":4},"00:45:00"]
["勤務終了時刻",null,4,"教諭","宮城　嘉浩",{"v":3,"d":"3班"},null,null,1,"木","12:00:00","12:45:00",{"$nulls":4},"00:45:00"]
[{"$f":"A7+TIMEVALUE(\"7:45\")+TIMEVALUE(\"0：45\")","v":"16:25:00"},null,5,"教諭","秋田　敬久",{"v":4,"d":"4班"},null,null,1,"金","12:00:00","12:45:00",{"$nulls":4},"00:45:00"]
[null,null,6,"教諭","山形　美栄子",{"v":3,"d":"3班"},null,null,1,"長期休業","12:00:00","12:45:00",{"$nulls":4},"00:45:00"]
["年（西暦）",null,7,"教諭","福島　雅雄",{"v":3,"d":"3班"},null,null,1,{"$nulls":7},""]
[2024,null,8,"教諭","茨城　和彦",{"v":1,"d":"1班"},null,null,2,"月","12:00:00","12:30:00","15:35:00","15:50:00",null,null,{"$f":"IF(K13=\"\",\"\",(L13-K13)+(N13-M13)+(P13-O13))","v":"00:45:00"}]
[null,null,9,"教諭","栃木　富一",{"v":4,"d":"4班"},null,null,2,"火","12:00:00","12:30:00","15:35:00","15:50:00",null,null,"00:45:00"]
[null,null,10,"教諭","群馬　一太",{"v":4,"d":"4班"},null,null,2,"水","12:00:00","12:30:00","15:15:00","15:30:00",null,null,"00:45:00"]
[null,null,11,"教諭","埼玉　元裕",{"v":3,"d":"3班"},null,null,2,"木","12:00:00","12:30:00","15:35:00","15:50:00",null,null,"00:45:00"]
[null,null,12,"教諭","千葉　俊人",{"v":3,"d":"3班"},null,null,2,"金","12:00:00","12:30:00","15:15:00","15:30:00",null,null,"00:45:00"]
[null,null,13,"教諭","神奈川　祐治",{"v":4,"d":"4班"},null,null,2,"長期休業","12:00:00","12:45:00",{"$nulls":4},"00:45:00"]
[null,null,14,"教諭","大阪　洋文",{"v":3,"d":"3班"},null,null,2,{"$nulls":7},""]
[null,null,15,"養護助教諭","東京　百合子",{"v":2,"d":"2班"},null,null,3,"月","13:10:00","13:25:00","15:35:00","16:05:00",null,null,{"$f":"IF(K20=\"\",\"\",(L20-K20)+(N20-M20)+(P20-O20))","v":"00:45:00"}]
[null,null,16,"総括事務主幹","沖縄　デニー",{"v":2,"d":"2班"},null,null,3,"火","13:10:00","13:25:00","15:35:00","16:05:00",null,null,"00:45:00"]
[null,null,17,{"$nulls":5},3,"水","12:50:00","13:05:00","15:15:00","15:45:00",null,null,"00:45:00"]
[null,null,18,{"$nulls":5},3,"木","13:10:00","13:25:00","15:35:00","16:05:00",null,null,"00:45:00"]
[null,null,19,{"$nulls":5},3,"金","12:50:00","13:05:00","15:15:00","15:45:00",null,null,"00:45:00"]
[null,null,20,{"$nulls":5},3,"長期休業","12:00:00","12:45:00",{"$nulls":4},"00:45:00"]
[null,null,21,{"$nulls":5},3,{"$nulls":7},""]
[null,null,22,{"$nulls":5},4,"月","13:25:00","13:40:00","15:35:00","16:05:00",null,null,{"$f":"IF(K27=\"\",\"\",(L27-K27)+(N27-M27)+(P27-O27))","v":"00:45:00"}]
[null,null,23,{"$nulls":5},4,"火","13:25:00","13:40:00","15:35:00","16:05:00",null,null,"00:45:00"]
[null,null,24,{"$nulls":5},4,"水","13:05:00","13:20:00","15:15:00","15:45:00",null,null,"00:45:00"]
[null,null,25,{"$nulls":5},4,"木","13:25:00","13:40:00","15:35:00","16:05:00",null,null,"00:45:00"]
[null,null,26,{"$nulls":5},4,"金","13:05:00","13:20:00","15:15:00","15:45:00",null,null,"00:45:00"]
[null,null,27,{"$nulls":5},4,"長期休業","12:00:00","12:45:00",{"$nulls":4},"00:45:00"]
[null,null,28,{"$nulls":5},4,{"$nulls":7},""]
[null,null,29]
[null,null,30]
[null,null,31]
[null,null,32]
[null,null,33]
[null,null,34]
[null,null,35]
{"$rows_left_out":6}
{"sheet":"計算シート","index":2,"n_rows":112,"n_cols":27,"rows_kept":112,"merged":[[2,1,2,2],[2,4,2,5],[2,7,2,8],[2,10,2,11],[2,13,2,16],[3,4,3,5],[3,10,3,11],[6,1,6,8],[8,2,8,4],[8,6,8,7],[8,9,8,11],[9,1,10,1],[9,2,9,6],[9,7,10,8],[9,9,10,9],[9,10,10,11],[10,3,10,4],[10,5,10,6],[11,1,13,1],[11,9,13,9],[11,10,11,11],[12,10,12,11],[13,10,13,11],[14,0,16,0],[14,1,16,1],[14,9,16,9],[14,10,14,11],[15,10,15,11],[16,10,16,11]]}
[null,null,"年次休暇（時間休）計算",{"$nulls":4},{"$f":"基礎データシート!A13","v":2024},"年"]
[]
[null,"勤務時間",null,null,"休憩班区分",null,null,"曜日",null,null,"長期休業",null,null,"休憩時間"]
[null,"開始",{"$f":"基礎データシート!A7","v":"07:55:00"},null,{"$f":"INDEX(基礎データシート!D6:F45,MATCH(J9,基礎データシート!E6:E45,0),3)","v":{"v":1,"d":"1班"}},null,null,{"$f":"TEXT(C15,\"aaa\")","v":"木"},{"$f":"IF(K4=\"該当\",6,WEEKDAY(C15,2))","v":4},null,{"$f":"IF(COUNTIF(T21:T25,\"該当\")>=1,\"該当\",\"非該当\")","v":"非該当"},null,null,1,{"$f":"IF(INDIRECT(\"基礎データシート!k\" & (E4*7+I4-2))>0,INDIRECT(\"基礎データシート!k\" & (E4*7+I4-2)),\"\")","v":"12:00:00"},"～",{"$f":"IF(INDIRECT(\"基礎データシート!l\" & (E4*7+I4-2))>0,INDIRECT(\"基礎データシート!l\" & (E4*7+I4-2)),\"\")","v":"12:45:00"}]
[null,"終了",{"$f":"基礎データシート!A10","v":"16:25:00"},{"$nulls":10},2,{"$f":"IF(INDIRECT(\"基礎データシート!m\" & (E4*7+I4-2))>0,INDIRECT(\"基礎データシート!M\" & (E4*7+I4-2)),\"\")","v":""},"～",{"$f":"IF(INDIRECT(\"基礎データシート!n\" & (E4*7+I4-2))>0,INDIRECT(\"基礎データシート!n\" & (E4*7+I4-2)),\"\")","v":""}]
[{"$nulls":13},3,{"$f":"IF(INDIRECT(\"基礎データシート!o\" & (E4*7+I4-2))>0,INDIRECT(\"基礎データシート!o\" & (E4*7+I4-2)),\"\")","v":""},"～",{"$f":"IF(INDIRECT(\"基礎データシート!P\" & (E4*7+I4-2))>0,INDIRECT(\"基礎データシート!P\" & (E4*7+I4-2)),\"\")","v":""}]
[null,{"$f":"IF(OR(T89<>\"\",T90<>\"\",T91<>\"\",T92<>\"\"),\"(;・∀・)　\"&IF(T89<>\"\",T89,\"\")&IF(T90<>\"\",T90,\"\")&IF(T91<>\"\",T91,\"\")&IF(T92<>\"\",T92,\"\"),\"\")","v":""}]
[]
[null,"所属名",{"$f":"基礎データシート!A4","v":"青森市立青森小学校"},null,null,"職名",{"$f":"INDEX(基礎データシート!D6:F45,MATCH(J9,基礎データシート!E6:E45,0),1)","v":"教諭"},null,"氏名","茨城　和彦"]
[null,null,"期　　　　　　間",{"$nulls":4},"残日数\n・時間",null,"届出\n月日","備考"]
[null,null,"（月日）","（時間）",null,"（取得時間）"]
[null,"既取得分",null,null,"から",null,"日",27.5,"日"]
[{"$nulls":6},"時間",1,"時間"]
[{"$nulls":4},"まで",null,null,30,"分"]
[null,"今回\n取得分","2024-12-05","07:55:00","から",{"$f":"IF(C17=\"\",IF(T74=\"半休\",0.5,\"\"),IF(T74=\"半休\",0.5,IF(D15=\"\",C17-C15+1,\"\")))","v":0.5},"日",{"$f":"T82+T83","v":27},"日",null,{"$f":"IF(T74=\"半休\",\"\",IF(D17-D15>T64,\"休憩時間を除く\",\"\"))","v":""}]
[{"$nulls":5},{"$f":"IF(OR(D15=\"\",D17=\"\")=TRUE,\"\",IF(T74=\"半休\",\"\",HOUR(T65)))","v":""},"時間",{"$f":"T84","v":1},"時間",null,{"$f":"IF(T74=\"半休\",IF(D15=C4,\"午前\",\"午後\"),\"\")","v":"午前"}]
[null,null,"2024-12-05","12:00:00","まで",null,"分",{"$f":"T85","v":30},"分"]
[]
[{"$nulls":18},"取得日",{"$f":"C15","v":"2024-12-05"}]
[{"$nulls":20},"休業開始日","休業終了日","取得日は"]
[{"$nulls":18},"年始休業判定",{"$f":"IF(AND(W21=\"期間内\",基礎データシート!V6=\"有\"),\"該当\",\"非該当\")","v":"非該当"},{"$f":"DATEVALUE(基礎データシート!A13&\"/1/1\")","v":"2024-01-01"},{"$f":"DATEVALUE(基礎データシート!A13&\"/\"&基礎データシート!U6)","v":"2024-01-14"},{"$f":"IF(AND(U21<=T19,V21>=T19),\"期間内\",\"期間外\")","v":"期間外"}]
[{"$nulls":18},"年度始休業判定",{"$f":"IF(AND(W22=\"期間内\",基礎データシート!V4=\"有\"),\"該当\",\"非該当\")","v":"非該当"},{"$f":"DATEVALUE(基礎データシート!A13&\"/\"&基礎データシート!T4)","v":"2024-04-01"},{"$f":"DATEVALUE(基礎データシート!A13&\"/\"&基礎データシート!U4)","v":"2024-04-06"},{"$f":"IF(AND(U22<=T19,V22>=T19),\"期間内\",\"期間外\")","v":"期間外"}]
[{"$nulls":18},"夏季休業判定",{"$f":"IF(AND(W23=\"期間内\",基礎データシート!V5=\"有\"),\"該当\",\"非該当\")","v":"非該当"},{"$f":"DATEVALUE(基礎データシート!A13&\"/\"&基礎データシート!T5)","v":"2024-07-22"},{"$f":"DATEVALUE(基礎データシート!A13&\"/\"&基礎データシート!U5)","v":"2024-08-23"},{"$f":"IF(AND(U23<=T19,V23>=T19),\"期間内\",\"期間外\")","v":"期間外"}]
[{"$nulls":18},"冬季休業判定",{"$f":"IF(AND(W24=\"期間内\",基礎データシート!V6=\"有\"),\"該当\",\"非該当\")","v":"非該当"},{"$f":"DATEVALUE(基礎データシート!A13&\"/\"&基礎データシート!T6)","v":"2024-12-24"},{"$f":"DATEVALUE(基礎データシート!A13+1&\"/\"&基礎データシート!U6)","v":"2025-01-14"},{"$f":"IF(AND(U24<=T19,V24>=T19),\"期間内\",\"期間外\")","v":"期間外"}]
[{"$nulls":18},"年度末休業判定",{"$f":"IF(AND(W25=\"期間内\",基礎データシート!V7=\"有\"),\"該当\",\"非該当\")","v":"非該当"},{"$f":"DATEVALUE(基礎データシート!A13&\"/\"&基礎データシート!T7)","v":"2024-03-27"},{"$f":"DATEVALUE(基礎データシート!A13&\"/\"&基礎データシート!U7)","v":"2024-03-31"},{"$f":"IF(AND(U25<=T19,V25>=T19),\"期間内\",\"期間外\")","v":"期間外"}]
[]
[]
[{"$nulls":19},"開始","終了","経過時間"]
[{"$nulls":18},"勤務時間",{"$f":"基礎データシート!A7","v":"07:55:00"},{"$f":"基礎データシート!A10","v":"16:25:00"}]
[{"$nulls":18},"勤務開始～休憩①",null,null,{"$f":"IF(T31<>\"\",T31-T29,0)","v":"04:05:00"},null,"開始時刻","終了時刻","判定","備考欄表記用"]
[{"$nulls":18},"休憩①",{"$f":"O4","v":"12:00:00"},{"$f":"Q4","v":"12:45:00"},{"$f":"IF(T31<>\"\",U31-T31,0)","v":"00:45:00"},"休暇時間内",{"$f":"IF(AND(T29>$T$52,T29<$T$52),1,0)","v":0},{"$f":"IF(AND(U31>$T$52,U31<$U$52),1,0)","v":0},{"$f":"SUM(X31:Y31)","v":0},{"$f":"IF(Z31>0,TEXT(T31,\"hh:mm\")&\"～\"&TEXT(U31,\"hh:mm\"),\"\")","v":""}]
[{"$nulls":18},"休憩①～②",null,null,{"$f":"IF(T33<>\"\",T33-U31,0)","v":"00:00:00"},"に休憩が時"]
[{"$nulls":18},"休憩②",{"$f":"O5","v":""},{"$f":"Q5","v":""},{"$f":"IF(T33<>\"\",U33-T33,0)","v":"00:00:00"},"間が含まれ",{"$f":"IF(AND(T30>$T$52,T30<$T$52),1,0)","v":0},{"$f":"IF(AND(U33>$T$52,U33<$U$52),1,0)","v":0},{"$f":"SUM(X33:Y33)","v":0},{"$f":"IF(AND(Z31>0,Z33>0),\"、\",\"\")&IF(Z33>0,TEXT(T33,\"hh:mm\")&\"～\"&TEXT(U33,\"hh:mm\"),\"\")","v":""}]
[{"$nulls":18},"休憩②～③",null,null,{"$f":"IF(T35<>\"\",T35-U33,0)","v":"00:00:00"},"ているかの"]
[{"$nulls":18},"休憩③",{"$f":"O6","v":""},{"$f":"Q6","v":""},{"$f":"IF(T35<>\"\",U35-T35,0)","v":"00:00:00"},"判定",{"$f":"IF(AND(T31>$T$52,T31<$T$52),1,0)","v":0},{"$f":"IF(AND(U35>$T$52,U35<$U$52),1,0)","v":0},{"$f":"SUM(X35:Y35)","v":0},{"$f":"IF(AND(Z33>0,Z35>0),\"、\",\"\")&IF(Z35>0,TEXT(T35,\"hh:mm\")&\"～\"&TEXT(U35,\"hh:mm\"),\"\")","v":""}]
[{"$nulls":18},"休憩③～勤務終了",null,null,{"$f":"IF(U35<>\"\",U29-U35,IF(U33<>\"\",U29-U33,IF(U31<>\"\",U29-U31,0)))","v":"03:40:00"}]
[{"$nulls":18},"休憩時間合計",{"$f":"(U31-T31)+IF(O5=\"\",0,(U33-T33))+IF(O6=\"\",0,(U35-T35))","v":"00:45:00"},"経過時間合計",{"$f":"SUM(V30:V36)","v":"08:30:00"}]
[]
[]
[{"$nulls":19},"開始","終了","経過時間"]
{"$rows_left_out":73}
{"sheet":"年休累計シート","index":3,"n_rows":203,"n_cols":30,"rows_kept":203,"merged":[[1,1,1,4],[1,5,1,10],[1,11,1,16],[2,1,2,4],[5,28,5,29],[6,26,6,28]]}
[]
[null,"取得日数（時間数）",{"$nulls":3},"累計日数（時間数）",{"$nulls":5},"残日数",{"$nulls":5},"１日半日取得分の累計","時間取得分の累計","時間取得分の日数","時間取得分の時間数","残日数","残時間数","残分数","検算"]
[{"$nulls":11},40,"日",0,"時間",0,"分"]
[1,null,"日",3,"時間",{"$f":"IF(AND(ISBLANK(B4)=TRUE,ISBLANK(D4)=TRUE),\"\",R4+T4)","v":0},"日",{"$f":"IF(AND(ISBLANK(B4)=TRUE,ISBLANK(D4)=TRUE),\"\",INT(U4))","v":3},"時間",{"$f":"IF(AND(ISBLANK(B4)=TRUE,ISBLANK(D4)=TRUE),\"\",MOD(U4,1)*60)","v":0},"分",{"$f":"IF(AND(ISBLANK(B4)=TRUE,ISBLANK(D4)=TRUE),\"\",V4)","v":39},"日",{"$f":"IF(AND(ISBLANK(B4)=TRUE,ISBLANK(D4)=TRUE),\"\",W4)","v":4},"時間",{"$f":"IF(AND(ISBLANK(B4)=TRUE,ISBLANK(D4)=TRUE),\"\",X4)","v":45},"分",{"$f":"R3+B4","v":0},{"$f":"D3+D4","v":3},{"$f":"INT(S4/7.75)","v":{"v":0,"d":"0.00"}},{"$f":"IF(H3+J3/60+D4<7.75,H3+J3/60+D4,MOD(H3+J3/60+D4,7.75))","v":{"v":3,"d":"3.00"}},{"$f":"IF(N3-D4>=0,L3-B4,L3-B4-1)","v":{"v":39,"d":"39.00"}},{"$f":"IF(N3+P3/60-D4>=0,INT(N3+P3/60-D4),INT(N3+P3/60+7.75-D4))","v":{"v":4,"d":"4.00"}},{"$f":"IF(N3-D4>=0,MOD(N3+P3/60-D4,1)*60,MOD(N3+7.75+P3/60-D4,1)*60)","v":45},{"$f":"F4+L4+(H4+J4/60+N4+P4/60)/7.75","v":40},null,"累計（小数計算）"]
[2,null,"日",2,"時間",0,"日",{"$f":"IF(AND(ISBLANK(B5)=TRUE,ISBLANK(D5)=TRUE),\"\",INT(U5))","v":5},"時間",{"$f":"IF(AND(ISBLANK(B5)=TRUE,ISBLANK(D5)=TRUE),\"\",MOD(U5,1)*60)","v":0},"分",{"$f":"IF(AND(ISBLANK(B5)=TRUE,ISBLANK(D5)=TRUE),\"\",V5)","v":39},"日",{"$f":"IF(AND(ISBLANK(B5)=TRUE,ISBLANK(D5)=TRUE),\"\",W5)","v":2},"時間",{"$f":"IF(AND(ISBLANK(B5)=TRUE,ISBLANK(D5)=TRUE),\"\",X5)","v":45},"分",{"$f":"R4+B5","v":0},{"$f":"S4+D5","v":5},{"v":0,"d":"0.00"},{"$f":"IF(H4+J4/60+D5<7.75,H4+J4/60+D5,MOD(H4+J4/60+D5,7.75))","v":{"v":5,"d":"5.00"}},{"$f":"IF(N4-D5>=0,L4-B5,L4-B5-1)","v":{"v":39,"d":"39.00"}},{"$f":"IF(N4+P4/60-D5>=0,INT(N4+P4/60-D5),INT(N4+P4/60+7.75-D5))","v":{"v":2,"d":"2.00"}},{"$f":"IF(N4-D5>=0,MOD(N4+P4/60-D5,1)*60,MOD(N4+7.75+P4/60-D5,1)*60)","v":45},{"$f":"F5+L5+(H5+J5/60+N5+P5/60)/7.75","v":40},null,{"$f":"SUM(B4:B203)","v":0},"日",{"$f":"SUM(D4:D203)","v":5},"時間"]
[3,null,"日",null,"時間","","日","","時間","","分","","日","","時間","","分",0,{"$f":"S5+D6","v":5},{"v":0,"d":"0.00"},{"v":5,"d":"5.00"},{"v":39,"d":"39.00"},{"$f":"IF(N5+P5/60-D6>=0,INT(N5+P5/60-D6),INT(N5+P5/60+7.75-D6))","v":{"v":2,"d":"2.00"}},45,{"$error":"#VALUE!"},{"$nulls":3},{"$f":"AC5/7.75","v":{"v":0.6451612903225806,"d":"( 0.645 日)"}}]
[4,null,"日",null,"時間","","日","","時間","","分","","日","","時間","","分",0,5,{"v":0,"d":"0.00"},{"$error":"#VALUE!"},{"$error":"#VALUE!"},{"$error":"#VALUE!"},{"$error":"#VALUE!"},{"$error":"#VALUE!"},null,{"$f":"AA5+AC6","v":{"v":0.6451612903225806,"d":"0.645"}},null,null,"日"]
[5,null,"日",null,"時間","","日","","時間","","分","","日","","時間","","分",0,5,{"v":0,"d":"0.00"},{"$error":"#VALUE!"},{"$error":"#VALUE!"},{"$error":"#VALUE!"},{"$error":"#VALUE!"},{"$error":"#VALUE!"},null,"（↑「人事行政の運営の状況に係る調査」等でご活用ください。）"]
[6,null,"日",null,"時間","","日","","時間","","分","","日","","時間","","分",0,5,{"v":0,"d":"0.00"},{"$error":"#VALUE!"},{"$error":"#VALUE!"},{"$error":"#VALUE!"},{"$error":"#VALUE!"},{"$error":"#VALUE!"}]
[7,null,"日",null,"時間","","日","","時間","","分","","日","","時間","","分",0,5,{"v":0,"d":"0.00"},{"$error":"#VALUE!"},{"$error":"#VALUE!"},{"$error":"#VALUE!"},{"$error":"#VALUE!"},{"$error":"#VALUE!"}]
[8,null,"日",null,"時間","","日","","時間","","分","","日","","時間","","分",0,5,{"v":0,"d":"0.00"},{"$error":"#VALUE!"},{"$error":"#VALUE!"},{"$error":"#VALUE!"},{"$error":"#VALUE!"},{"$error":"#VALUE!"}]
[9,null,"日",null,"時間",{"$f":"IF(AND(ISBLANK(B12)=TRUE,ISBLANK(D12)=TRUE),\"\",R12+T12)","v":""},"日",{"$f":"IF(AND(ISBLANK(B12)=TRUE,ISBLANK(D12)=TRUE),\"\",INT(U12))","v":""},"時間",{"$f":"IF(AND(ISBLANK(B12)=TRUE,ISBLANK(D12)=TRUE),\"\",MOD(U12,1)*60)","v":""},"分",{"$f":"IF(AND(ISBLANK(B12)=TRUE,ISBLANK(D12)=TRUE),\"\",V12)","v":""},"日",{"$f":"IF(AND(ISBLANK(B12)=TRUE,ISBLANK(D12)=TRUE),\"\",W12)","v":""},"時間",{"$f":"IF(AND(ISBLANK(B12)=TRUE,ISBLANK(D12)=TRUE),\"\",X12)","v":""},"分",{"$f":"R11+B12","v":0},5,{"v":0,"d":"0.00"},{"$error":"#VALUE!"},{"$f":"IF(N11-D12>=0,L11-B12,L11-B12-1)","v":{"$error":"#VALUE!"}},{"$error":"#VALUE!"},{"$error":"#VALUE!"},{"$error":"#VALUE!"}]
[10,null,"日",null,"時間",{"$f":"IF(AND(ISBLANK(B13)=TRUE,ISBLANK(D13)=TRUE),\"\",R13+T13)","v":""},"日",{"$f":"IF(AND(ISBLANK(B13)=TRUE,ISBLANK(D13)=TRUE),\"\",INT(U13))","v":""},"時間",{"$f":"IF(AND(ISBLANK(B13)=TRUE,ISBLANK(D13)=TRUE),\"\",MOD(U13,1)*60)","v":""},"分",{"$f":"IF(AND(ISBLANK(B13)=TRUE,ISBLANK(D13)=TRUE),\"\",V13)","v":""},"日",{"$f":"IF(AND(ISBLANK(B13)=TRUE,ISBLANK(D13)=TRUE),\"\",W13)","v":""},"時間",{"$f":"IF(AND(ISBLANK(B13)=TRUE,ISBLANK(D13)=TRUE),\"\",X13)","v":""},"分",{"$f":"R12+B13","v":0},5,{"v":0,"d":"0.00"},{"$error":"#VALUE!"},{"$f":"IF(N12-D13>=0,L12-B13,L12-B13-1)","v":{"$error":"#VALUE!"}},{"$error":"#VALUE!"},{"$error":"#VALUE!"},{"$error":"#VALUE!"}]
[11,null,"日",null,"時間","","日","","時間","","分","","日","","時間","","分",0,5,{"v":0,"d":"0.00"},{"$error":"#VALUE!"},{"$error":"#VALUE!"},{"$error":"#VALUE!"},{"$error":"#VALUE!"},{"$error":"#VALUE!"}]
[12,null,"日",null,"時間","","日","","時間","","分","","日","","時間","","分",0,5,{"v":0,"d":"0.00"},{"$error":"#VALUE!"},{"$error":"#VALUE!"},{"$error":"#VALUE!"},{"$error":"#VALUE!"},{"$error":"#VALUE!"}]
[13,null,"日",null,"時間","","日","","時間","","分","","日","","時間","","分",0,5,{"v":0,"d":"0.00"},{"$error":"#VALUE!"},{"$error":"#VALUE!"},{"$error":"#VALUE!"},{"$error":"#VALUE!"},{"$error":"#VALUE!"}]
[14,null,"日",null,"時間","","日","","時間","","分","","日","","時間","","分",0,5,{"v":0,"d":"0.00"},{"$error":"#VALUE!"},{"$error":"#VALUE!"},{"$error":"#VALUE!"},{"$error":"#VALUE!"},{"$error":"#VALUE!"}]
[15,null,"日",null,"時間","","日","","時間","","分","","日","","時間","","分",0,5,{"v":0,"d":"0.00"},{"$error":"#VALUE!"},{"$error":"#VALUE!"},{"$error":"#VALUE!"},{"$error":"#VALUE!"},{"$error":"#VALUE!"}]
[16,null,"日",null,"時間","","日","","時間","","分","","日","","時間","","分",0,5,{"v":0,"d":"0.00"},{"$error":"#VALUE!"},{"$error":"#VALUE!"},{"$error":"#VALUE!"},{"$error":"#VALUE!"},{"$error":"#VALUE!"}]
[17,null,"日",null,"時間","","日","","時間","","分","","日","","時間","","分",0,5,{"v":0,"d":"0.00"},{"$error":"#VALUE!"},{"$error":"#VALUE!"},{"$error":"#VALUE!"},{"$error":"#VALUE!"},{"$error":"#VALUE!"}]
[18,null,"日",null,"時間","","日","","時間","","分","","日","","時間","","分",0,5,{"v":0,"d":"0.00"},{"$error":"#VALUE!"},{"$error":"#VALUE!"},{"$error":"#VALUE!"},{"$error":"#VALUE!"},{"$error":"#VALUE!"}]
[19,null,"日",null,"時間","","日","","時間","","分","","日","","時間","","分",0,5,{"v":0,"d":"0.00"},{"$error":"#VALUE!"},{"$error":"#VALUE!"},{"$error":"#VALUE!"},{"$error":"#VALUE!"},{"$error":"#VALUE!"}]
[20,null,"日",null,"時間","","日","","時間","","分","","日","","時間","","分",0,5,{"v":0,"d":"0.00"},{"$error":"#VALUE!"},{"$error":"#VALUE!"},{"$error":"#VALUE!"},{"$error":"#VALUE!"},{"$error":"#VALUE!"}]
[21,null,"日",null,"時間","","日","","時間","","分","","日","","時間","","分",0,5,{"v":0,"d":"0.00"},{"$error":"#VALUE!"},{"$error":"#VALUE!"},{"$error":"#VALUE!"},{"$error":"#VALUE!"},{"$error":"#VALUE!"}]
[22,null,"日",null,"時間","","日","","時間","","分","","日","","時間","","分",0,5,{"v":0,"d":"0.00"},{"$error":"#VALUE!"},{"$error":"#VALUE!"},{"$error":"#VALUE!"},{"$error":"#VALUE!"},{"$error":"#VALUE!"}]
[23,null,"日",null,"時間","","日","","時間","","分","","日","","時間","","分",0,5,{"v":0,"d":"0.00"},{"$error":"#VALUE!"},{"$error":"#VALUE!"},{"$error":"#VALUE!"},{"$error":"#VALUE!"},{"$error":"#VALUE!"}]
[24,null,"日",null,"時間","","日","","時間","","分","","日","","時間","","分",0,5,{"v":0,"d":"0.00"},{"$error":"#VALUE!"},{"$error":"#VALUE!"},{"$error":"#VALUE!"},{"$error":"#VALUE!"},{"$error":"#VALUE!"}]
[25,null,"日",null,"時間","","日","","時間","","分","","日","","時間","","分",0,5,{"v":0,"d":"0.00"},{"$error":"#VALUE!"},{"$error":"#VALUE!"},{"$error":"#VALUE!"},{"$error":"#VALUE!"},{"$error":"#VALUE!"}]
[26,null,"日",null,"時間","","日","","時間","","分","","日","","時間","","分",0,5,{"v":0,"d":"0.00"},{"$error":"#VALUE!"},{"$error":"#VALUE!"},{"$error":"#VALUE!"},{"$error":"#VALUE!"},{"$error":"#VALUE!"}]
[27,null,"日",null,"時間","","日","","時間","","分","","日","","時間","","分",0,5,{"v":0,"d":"0.00"},{"$error":"#VALUE!"},{"$error":"#VALUE!"},{"$error":"#VALUE!"},{"$error":"#VALUE!"},{"$error":"#VALUE!"}]
[28,null,"日",null,"時間","","日","","時間","","分","","日","","時間","","分",0,5,{"v":0,"d":"0.00"},{"$error":"#VALUE!"},{"$error":"#VALUE!"},{"$error":"#VALUE!"},{"$error":"#VALUE!"},{"$error":"#VALUE!"}]
[29,null,"日",null,"時間","","日","","時間","","分","","日","","時間","","分",0,5,{"v":0,"d":"0.00"},{"$error":"#VALUE!"},{"$error":"#VALUE!"},{"$error":"#VALUE!"},{"$error":"#VALUE!"},{"$error":"#VALUE!"}]
[30,null,"日",null,"時間","","日","","時間","","分","","日","","時間","","分",0,5,{"v":0,"d":"0.00"},{"$error":"#VALUE!"},{"$error":"#VALUE!"},{"$error":"#VALUE!"},{"$error":"#VALUE!"},{"$error":"#VALUE!"}]
[31,null,"日",null,"時間","","日","","時間","","分","","日","","時間","","分",0,5,{"v":0,"d":"0.00"},{"$error":"#VALUE!"},{"$error":"#VALUE!"},{"$error":"#VALUE!"},{"$error":"#VALUE!"},{"$error":"#VALUE!"}]
[32,null,"日",null,"時間","","日","","時間","","分","","日","","時間","","分",0,5,{"v":0,"d":"0.00"},{"$error":"#VALUE!"},{"$error":"#VALUE!"},{"$error":"#VALUE!"},{"$error":"#VALUE!"},{"$error":"#VALUE!"}]
[33,null,"日",null,"時間","","日","","時間","","分","","日","","時間","","分",0,5,{"v":0,"d":"0.00"},{"$error":"#VALUE!"},{"$error":"#VALUE!"},{"$error":"#VALUE!"},{"$error":"#VALUE!"},{"$error":"#VALUE!"}]
[34,null,"日",null,"時間","","日","","時間","","分","","日","","時間","","分",0,5,{"v":0,"d":"0.00"},{"$error":"#VALUE!"},{"$error":"#VALUE!"},{"$error":"#VALUE!"},{"$error":"#VALUE!"},{"$error":"#VALUE!"}]
[35,null,"日",null,"時間","","日","","時間","","分","","日","","時間","","分",0,5,{"v":0,"d":"0.00"},{"$error":"#VALUE!"},{"$error":"#VALUE!"},{"$error":"#VALUE!"},{"$error":"#VALUE!"},{"$error":"#VALUE!"}]
[36,null,"日",null,"時間","","日","","時間","","分","","日","","時間","","分",0,5,{"v":0,"d":"0.00"},{"$error":"#VALUE!"},{"$error":"#VALUE!"},{"$error":"#VALUE!"},{"$error":"#VALUE!"},{"$error":"#VALUE!"}]
[37,null,"日",null,"時間","","日","","時間","","分","","日","","時間","","分",0,5,{"v":0,"d":"0.00"},{"$error":"#VALUE!"},{"$error":"#VALUE!"},{"$error":"#VALUE!"},{"$error":"#VALUE!"},{"$error":"#VALUE!"}]
{"$rows_left_out":163}